Target
Tyrosine-protein phosphatase non-receptor type 7
Ligand
BDBM46224
Substrate
Meas. Tech.
Fluorescent secondary assay for dose-response confirmation of chemical inhibitors of HePTP
IC50
320±n/a nM
Citation
 PubChem, PC Fluorescent secondary assay for dose-response confirmation of chemical inhibitors of HePTP PubChem Bioassay (2009)[AID] 
Target
Name:
Tyrosine-protein phosphatase non-receptor type 7
Synonyms:
He-PTP Hematopoietic protein-tyrosine phosphatase (HEPTP) PTPN7 Tyrosine-protein phosphatase non-receptor type 7 | Tyrosine-protein phosphatase non-receptor type 7 (HEPTP)
Type:
Protein
Mol. Mass.:
40530.79
Organism:
Homo sapiens (Human)
Description:
P35236
Residue:
360
  
Inhibitor
Name:
BDBM46224
Synonyms:
2-[2-bromanyl-4-[(Z)-[2-[(4-ethylphenyl)amino]-4-oxidanylidene-1,3-thiazol-5-ylidene]methyl]-6-methoxy-phenoxy]ethanoic acid 2-[2-bromo-4-[(Z)-[2-(4-ethylanilino)-4-oxo-1,3-thiazol-5-ylidene]methyl]-6-methoxyphenoxy]acetic acid MLS-0343544.0001 | cid_5765581
Type:
Small organic molecule
Emp. Form.:
C21H19BrN2O5S
Mol. Mass.:
491.355
SMILES:
CCc1ccc(NC2=NC(=O)C(S2)=Cc2cc(Br)c(OCC(O)=O)c(OC)c2)cc1
: