Target
Phosphatidylinositol 4,5-bisphosphate 3-kinase catalytic subunit beta isoform
Ligand
BDBM119232
Substrate
Meas. Tech.
In Vitro Enzyme Inhibition Assay
Temperature
298.15±n/a K
IC50
9.00±n/a nM
Comments
extracted
Citation
 Barlaam, BCDegorce, SLLambert-Van Der Brempt, CMMorgentin, RRPle, P Chromenone derivatives US Patent  US9718800 Publication Date 8/1/2017 
Target
Name:
Phosphatidylinositol 4,5-bisphosphate 3-kinase catalytic subunit beta isoform
Synonyms:
PI3-kinase p110 subunit beta PI3Kbeta PIK3CB Phosphatidylinositol 4,5-bisphosphate 3-kinase catalytic subunit beta (PI3Kbeta) Phosphatidylinositol 4,5-bisphosphate 3-kinase catalytic subunit beta isoform (PI3K) Phosphatidylinositol 4,5-bisphosphate 3-kinase catalytic subunit beta isoform (PI3Kbeta) Phosphatidylinositol-4,5-bisphosphate 3-kinase catalytic subunit beta isoform Phosphoinositide 3-Kinase (PI3K), beta Chain A PtdIns-3-kinase p110
Type:
Enzyme Subunit
Mol. Mass.:
122769.00
Organism:
Homo sapiens (Human)
Description:
P42338
Residue:
1070
  
Inhibitor
Name:
BDBM119232
Synonyms:
US8673906, 2 | US9718800, 2.00
Type:
Small organic molecule
Emp. Form.:
C26H30ClFN4O4
Mol. Mass.:
516.992
SMILES:
CC(Nc1cccc(Cl)c1F)c1cc(cc2c1oc(cc2=O)N1CCOCC1)C(=O)NCCN(C)C
: