Target
Glutathione S-transferase Mu 1
Ligand
BDBM32265
Substrate
Meas. Tech.
Profiling Assay to determine GST-GSH interactions in multiplex bead-based assays (HPSMTB buffer)
EC50
10980±n/a nM
Citation
 PubChem, PC Profiling Assay to determine GST-GSH interactions in multiplex bead-based assays (HPSMTB buffer) PubChem Bioassay (2008)[AID] 
Target
Name:
Glutathione S-transferase Mu 1
Synonyms:
GST class-mu 1 GSTM1 GSTM1_HUMAN GSTM1b-1b Glutathione S-transferase Mu 1 glutathione S-transferase
Type:
PROTEIN
Mol. Mass.:
25712.03
Organism:
Homo sapiens (Human)
Description:
ChEMBL_799596
Residue:
218
  
Inhibitor
Name:
BDBM32265
Synonyms:
4-(3-ethoxypropylamino)-6,7-dimethoxy-1H-quinazoline-2-thione MLS000045007 cid_3237310
Type:
Small organic molecule
Emp. Form.:
C15H21N3O3S
Mol. Mass.:
323.411
SMILES:
CCOCCCNc1[nH]c(=S)nc2cc(OC)c(OC)cc12
: