Target
Glutathione S-transferase Mu 1
Ligand
BDBM31713
Substrate
Meas. Tech.
Profiling Assay to determine GST-GSH interactions in multiplex bead-based assays (HPSMTB buffer)
EC50
8300±n/a nM
Citation
 PubChem, PC Profiling Assay to determine GST-GSH interactions in multiplex bead-based assays (HPSMTB buffer) PubChem Bioassay (2008)[AID] 
Target
Name:
Glutathione S-transferase Mu 1
Synonyms:
GST class-mu 1 GSTM1 GSTM1_HUMAN GSTM1b-1b Glutathione S-transferase Mu 1 glutathione S-transferase
Type:
PROTEIN
Mol. Mass.:
25712.03
Organism:
Homo sapiens (Human)
Description:
ChEMBL_799596
Residue:
218
  
Inhibitor
Name:
BDBM31713
Synonyms:
1-Cyclopropyl-3-(2,3-di-furan-2-yl-quinoxalin-6-yl)-urea 1-[2,3-bis(2-furyl)quinoxalin-6-yl]-3-cyclopropyl-urea 1-[2,3-bis(furan-2-yl)quinoxalin-6-yl]-3-cyclopropylurea SMR000118524 | cid_1072898
Type:
Small organic molecule
Emp. Form.:
C20H16N4O3
Mol. Mass.:
360.366
SMILES:
O=C(NC1CC1)Nc1ccc2nc(-c3ccco3)c(nc2c1)-c1ccco1
: