Target
Alkaline phosphatase, germ cell type
Ligand
BDBM43790
Substrate
Meas. Tech.
Luminescent assay for HTS discovery of chemical inhibitors of placental alkaline phosphatase confirmation
IC50
>100000±n/a nM
Citation
 PubChem, PC Luminescent assay for HTS discovery of chemical inhibitors of placental alkaline phosphatase confirmation PubChem Bioassay (2009)[AID] 
Target
Name:
Alkaline phosphatase, germ cell type
Synonyms:
ALPG ALPPL2 PPBN_HUMAN | placental-like alkaline phosphatase preproprotein
Type:
PROTEIN
Mol. Mass.:
57374.31
Organism:
Homo sapiens (Human)
Description:
ChEMBL_29964
Residue:
532
  
Inhibitor
Name:
BDBM43790
Synonyms:
4-keto-N-(2-methoxyethyl)-4-[N'-(2-methyl-[1,2,4]triazolo[1,5-c]quinazolin-5-yl)hydrazino]butyramide N-(2-methoxyethyl)-4-[(2-methyl-[1,2,4]triazolo[1,5-c]quinazolin-5-yl)hydrazo]-4-oxobutanamide N-(2-methoxyethyl)-4-[2-(2-methyl-[1,2,4]triazolo[1,5-c]quinazolin-5-yl)hydrazinyl]-4-oxobutanamide | cid_16009014
Type:
Small organic molecule
Emp. Form.:
C17H21N7O3
Mol. Mass.:
371.3937
SMILES:
COCCNC(=O)CCC(=O)NNc1nc2ccccc2c2nc(C)nn12
: