Target
Alkaline phosphatase, germ cell type
Ligand
BDBM46017
Substrate
Meas. Tech.
Luminescent assay for HTS discovery of chemical inhibitors of placental alkaline phosphatase confirmation
IC50
1560±n/a nM
Citation
 PubChem, PC Luminescent assay for HTS discovery of chemical inhibitors of placental alkaline phosphatase confirmation PubChem Bioassay (2009)[AID] 
Target
Name:
Alkaline phosphatase, germ cell type
Synonyms:
ALPG ALPPL2 PPBN_HUMAN | placental-like alkaline phosphatase preproprotein
Type:
PROTEIN
Mol. Mass.:
57374.31
Organism:
Homo sapiens (Human)
Description:
ChEMBL_29964
Residue:
532
  
Inhibitor
Name:
BDBM46017
Synonyms:
2-[2-(3,4-dihydroxyphenyl)-2-oxoethyl]sulfanyl-4,6-dimethylpyridine-3-carbonitrile 2-[[2-(3,4-dihydroxyphenyl)-2-keto-ethyl]thio]-4,6-dimethyl-nicotinonitrile MLS-0315680.0001 | cid_720372
Type:
Small organic molecule
Emp. Form.:
C16H14N2O3S
Mol. Mass.:
314.359
SMILES:
Cc1cc(C)c(C#N)c(SCC(=O)c2ccc(O)c(O)c2)n1
: