Target
Transitional endoplasmic reticulum ATPase
Ligand
BDBM46555
Substrate
Meas. Tech.
Dose response biochemical high throughput screening assay for inhibitors of the p97 ATPase
IC50
5386±n/a nM
Citation
 PubChem, PC Dose response biochemical high throughput screening assay for inhibitors of the p97 ATPase PubChem Bioassay (2009)[AID] 
Target
Name:
Transitional endoplasmic reticulum ATPase
Synonyms:
TERA_HUMAN VCP Valosin-containing protein
Type:
Enzyme
Mol. Mass.:
89300.63
Organism:
Homo sapiens (Human)
Description:
P55072
Residue:
806
  
Inhibitor
Name:
BDBM46555
Synonyms:
GOSSYPOL ACETATE SMR000058743 acetic acid;7-(8-formyl-1,6,7-trihydroxy-3-methyl-5-propan-2-ylnaphthalen-2-yl)-2,3,8-trihydroxy-6-methyl-4-propan-2-ylnaphthalene-1-carbaldehyde cid_227456 gossypol acetic acid
Type:
Small organic molecule
Emp. Form.:
C30H30O8
Mol. Mass.:
518.5544
SMILES:
CC(C)c1c(O)c(O)c(C=O)c2c(O)c(c(C)cc12)-c1c(C)cc2c(C(C)C)c(O)c(O)c(C=O)c2c1O
: