Target
Mucolipin-3
Ligand
BDBM46828
Substrate
Meas. Tech.
Dose response cell-based high-throughput screening assay for agonists of the transient receptor potential channel ML3 (TRPML3)
EC50
1160±n/a nM
Citation
 PubChem, PC Dose response cell-based high-throughput screening assay for agonists of the transient receptor potential channel ML3 (TRPML3) PubChem Bioassay (2009)[AID] 
Target
Name:
Mucolipin-3
Synonyms:
MCLN3_HUMAN MCOLN3 protein
Type:
Enzyme Catalytic Domain
Mol. Mass.:
64244.09
Organism:
Homo sapiens (Human)
Description:
Q8TDD5
Residue:
553
  
Inhibitor
Name:
BDBM46828
Synonyms:
1-(methoxymethyl)-3-(4-methylphenyl)sulfonyl-5-prop-2-enoxy-indole 5-allyloxy-1-(methoxymethyl)-3-tosyl-indole SMR000060698 | cid_2324910
Type:
Small organic molecule
Emp. Form.:
C20H21NO4S
Mol. Mass.:
371.45
SMILES:
COCn1cc(c2cc(OCC=C)ccc12)S(=O)(=O)c1ccc(C)cc1
: