Target
Mucolipin-3
Ligand
BDBM46842
Substrate
Meas. Tech.
Dose response cell-based high-throughput screening assay for agonists of the transient receptor potential channel ML3 (TRPML3)
EC50
5070±n/a nM
Citation
 PubChem, PC Dose response cell-based high-throughput screening assay for agonists of the transient receptor potential channel ML3 (TRPML3) PubChem Bioassay (2009)[AID] 
Target
Name:
Mucolipin-3
Synonyms:
MCLN3_HUMAN MCOLN3 protein
Type:
Enzyme Catalytic Domain
Mol. Mass.:
64244.09
Organism:
Homo sapiens (Human)
Description:
Q8TDD5
Residue:
553
  
Inhibitor
Name:
BDBM46842
Synonyms:
3,4-dimethyl-2-(4-morpholinylmethyl)-6-(1-phenylethyl)phenol 3,4-dimethyl-2-(morpholinomethyl)-6-(1-phenylethyl)phenol SMR000076114 | cid_2952730
Type:
Small organic molecule
Emp. Form.:
C21H27NO2
Mol. Mass.:
325.4446
SMILES:
CC(c1ccccc1)c1cc(C)c(C)c(CN2CCOCC2)c1O
: