Target
Mucolipin-3
Ligand
BDBM39637
Substrate
Meas. Tech.
Dose response cell-based high-throughput screening assay for agonists of the transient receptor potential channel ML3 (TRPML3)
EC50
2830±n/a nM
Citation
 PubChem, PC Dose response cell-based high-throughput screening assay for agonists of the transient receptor potential channel ML3 (TRPML3) PubChem Bioassay (2009)[AID] 
Target
Name:
Mucolipin-3
Synonyms:
MCLN3_HUMAN MCOLN3 protein
Type:
Enzyme Catalytic Domain
Mol. Mass.:
64244.09
Organism:
Homo sapiens (Human)
Description:
Q8TDD5
Residue:
553
  
Inhibitor
Name:
BDBM39637
Synonyms:
4-Methyl-1-(naphthalene-2-sulfonyl)-piperidine 4-methyl-1-(2-naphthylsulfonyl)piperidine 4-methyl-1-naphthalen-2-ylsulfonylpiperidine SMR000122855 | cid_767330
Type:
Small organic molecule
Emp. Form.:
C16H19NO2S
Mol. Mass.:
289.393
SMILES:
CC1CCN(CC1)S(=O)(=O)c1ccc2ccccc2c1
: