Target
Mucolipin-3
Ligand
BDBM46862
Substrate
Meas. Tech.
Dose response cell-based high-throughput screening assay for agonists of the transient receptor potential channel ML3 (TRPML3)
EC50
5110±n/a nM
Citation
 PubChem, PC Dose response cell-based high-throughput screening assay for agonists of the transient receptor potential channel ML3 (TRPML3) PubChem Bioassay (2009)[AID] 
Target
Name:
Mucolipin-3
Synonyms:
MCLN3_HUMAN MCOLN3 protein
Type:
Enzyme Catalytic Domain
Mol. Mass.:
64244.09
Organism:
Homo sapiens (Human)
Description:
Q8TDD5
Residue:
553
  
Inhibitor
Name:
BDBM46862
Synonyms:
1-(2-methylphenyl)-4-(phenylsulfonyl)piperazine 1-Benzenesulfonyl-4-o-tolyl-piperazine MLS000035471 cid_740952
Type:
Small organic molecule
Emp. Form.:
C17H20N2O2S
Mol. Mass.:
316.418
SMILES:
Cc1ccccc1N1CCN(CC1)S(=O)(=O)c1ccccc1
: