Target
Muscarinic acetylcholine receptor M4
Ligand
BDBM50323691
Substrate
Meas. Tech.
Discovery of a Highly Selective in vitro and in vivo M4 Positive Allosteric Modulator(PAM): Analog Potency
EC50
0.000339±n/a nM
Citation
 PubChem, PC Discovery of a Highly Selective in vitro and in vivo M4 Positive Allosteric Modulator(PAM): Analog Potency PubChem Bioassay (2010)[AID] 
Target
Name:
Muscarinic acetylcholine receptor M4
Synonyms:
ACM4_RAT Chrm-4 | Chrm4
Type:
Enzyme Catalytic Domain
Mol. Mass.:
52841.70
Organism:
RAT
Description:
Cholinergic, muscarinic M4 CHRM4 RAT::P08485
Residue:
477
  
Inhibitor
Name:
BDBM50323691
Synonyms:
3-amino-N-(4-chlorobenzyl)-4,6-dimethylthieno[2,3-b]pyridine-2-carboxamide VU10010 | cid_714286
Type:
Small organic molecule
Emp. Form.:
C17H16ClN3OS
Mol. Mass.:
345.846
SMILES:
Cc1cc(C)c2c(N)c(sc2n1)C(=O)NCc1ccc(Cl)cc1
: