Target
Muscarinic acetylcholine receptor M4
Ligand
BDBM48045
Substrate
Meas. Tech.
Discovery of a Highly Selective in vitro and in vivo M4 Positive Allosteric Modulator(PAM): Analog Potency
EC50
0.000873±n/a nM
Citation
 PubChem, PC Discovery of a Highly Selective in vitro and in vivo M4 Positive Allosteric Modulator(PAM): Analog Potency PubChem Bioassay (2010)[AID] 
Target
Name:
Muscarinic acetylcholine receptor M4
Synonyms:
ACM4_RAT Chrm-4 | Chrm4
Type:
Enzyme Catalytic Domain
Mol. Mass.:
52841.70
Organism:
RAT
Description:
Cholinergic, muscarinic M4 CHRM4 RAT::P08485
Residue:
477
  
Inhibitor
Name:
BDBM48045
Synonyms:
3-amino-N-(2-fluorobenzyl)-4,6-dimethyl-thieno[2,3-b]pyridine-2-carboxamide 3-amino-N-[(2-fluorophenyl)methyl]-4,6-dimethylthieno[2,3-b]pyridine-2-carboxamide VU0402471-1 | cid_44176127
Type:
Small organic molecule
Emp. Form.:
C17H16FN3OS
Mol. Mass.:
329.392
SMILES:
Cc1cc(C)c2c(N)c(sc2n1)C(=O)NCc1ccccc1F
: