Target
D(1B) dopamine receptor
Ligand
BDBM9461
Substrate
Meas. Tech.
Allosteric Modulators of D1 Receptors: Dose-dependent Counterscreen
EC50
0.00334±n/a nM
Citation
 PubChem, PC Allosteric Modulators of D1 Receptors: Dose-dependent Counterscreen PubChem Bioassay (2007)[AID] 
Target
Name:
D(1B) dopamine receptor
Synonyms:
D(5) dopamine receptor DOPAMINE D5 DRD1L2 DRD5_HUMAN | dopamine receptor D5
Type:
Protein
Mol. Mass.:
52943.41
Organism:
Homo sapiens (Human)
Description:
P21918
Residue:
477
  
Inhibitor
Name:
BDBM9461
Synonyms:
5,7-dihydroxy-3-(4-methoxyphenyl)-4H-chromen-4-one Biochanin A (BCA) CHEMBL131921 | cid_5280373
Type:
Small organic molecule
Emp. Form.:
C16H12O5
Mol. Mass.:
284.2635
SMILES:
COc1ccc(cc1)-c1coc2cc(O)cc(O)c2c1=O
: