Target
D(1A) dopamine receptor
Ligand
BDBM49032
Substrate
Meas. Tech.
Allosteric Modulators of D1 Receptors: Dose-dependent Assay
EC50
0.00658±n/a nM
Citation
 PubChem, PC Allosteric Modulators of D1 Receptors: Dose-dependent Assay PubChem Bioassay (2007)[AID] 
Target
Name:
D(1A) dopamine receptor
Synonyms:
DA D1 receptor DRD1 Dopamine D1 receptor Dopamine D1A
Type:
Enzyme
Mol. Mass.:
49303.43
Organism:
Homo sapiens (Human)
Description:
P21728
Residue:
446
  
Inhibitor
Name:
BDBM49032
Synonyms:
6-amino-3-phenyl-4-propan-2-yl-2,4-dihydropyrano[2,3-c]pyrazole-5-carbonitrile 6-azanyl-3-phenyl-4-propan-2-yl-2,4-dihydropyrano[2,3-c]pyrazole-5-carbonitrile SMR000017376 | cid_2881578
Type:
Small organic molecule
Emp. Form.:
C16H16N4O
Mol. Mass.:
280.3244
SMILES:
CC(C)C1C(C#N)C(=N)Oc2[nH]nc(c12)-c1ccccc1
: