Target
Glycoprotein 42
Ligand
BDBM50954
Substrate
Meas. Tech.
Dose Response Confirmation for Small Molecule Inhibitors of Epstein-Barr Virus
IC50
1480±n/a nM
Citation
 PubChem, PC Dose Response Confirmation for Small Molecule Inhibitors of Epstein-Barr Virus PubChem Bioassay (2008)[AID] 
Target
Name:
Glycoprotein 42
Synonyms:
BZLF2 | GP42_EBVA8
Type:
Enzyme Catalytic Domain
Mol. Mass.:
25424.12
Organism:
Human herpesvirus 4 type 2
Description:
gi_139424501
Residue:
223
  
Inhibitor
Name:
BDBM50954
Synonyms:
2-(2,4-dichlorophenoxy)ethyl 3,4,6-tri-O-acetyl-2-(acetylamino)-2-deoxyhexopyranoside SMR000187251 [5-acetamido-3,4-diacetyloxy-6-[2-[2,4-bis(chloranyl)phenoxy]ethoxy]oxan-2-yl]methyl ethanoate acetic acid [5-acetamido-3,4-diacetyloxy-6-[2-(2,4-dichlorophenoxy)ethoxy]-2-oxanyl]methyl ester | cid_2870398
Type:
Small organic molecule
Emp. Form.:
C22H27Cl2NO10
Mol. Mass.:
536.356
SMILES:
CC(=O)NC1C(OCCOc2ccc(Cl)cc2Cl)OC(COC(C)=O)C(OC(C)=O)C1OC(C)=O
: