Target
Glycoprotein 42
Ligand
BDBM50999
Substrate
Meas. Tech.
Dose Response Confirmation for Small Molecule Inhibitors of Epstein-Barr Virus
IC50
6250±n/a nM
Citation
 PubChem, PC Dose Response Confirmation for Small Molecule Inhibitors of Epstein-Barr Virus PubChem Bioassay (2008)[AID] 
Target
Name:
Glycoprotein 42
Synonyms:
BZLF2 | GP42_EBVA8
Type:
Enzyme Catalytic Domain
Mol. Mass.:
25424.12
Organism:
Human herpesvirus 4 type 2
Description:
gi_139424501
Residue:
223
  
Inhibitor
Name:
BDBM50999
Synonyms:
3-(1,3-benzodioxol-5-yl)-2-methylsulfonyl-5-phenyl-3,4-dihydropyrazole 5-Benzo[1,3]dioxol-5-yl-1-methanesulfonyl-3-phenyl-4,5-dihydro-1H-pyrazole SMR000172323 | cid_3153499
Type:
Small organic molecule
Emp. Form.:
C17H16N2O4S
Mol. Mass.:
344.385
SMILES:
CS(=O)(=O)N1N=C(CC1c1ccc2OCOc2c1)c1ccccc1
: