Target
Glycoprotein 42
Ligand
BDBM50282
Substrate
Meas. Tech.
Dose Response Confirmation for Small Molecule Inhibitors of Epstein-Barr Virus
IC50
33750±n/a nM
Citation
 PubChem, PC Dose Response Confirmation for Small Molecule Inhibitors of Epstein-Barr Virus PubChem Bioassay (2008)[AID] 
Target
Name:
Glycoprotein 42
Synonyms:
BZLF2 | GP42_EBVA8
Type:
Enzyme Catalytic Domain
Mol. Mass.:
25424.12
Organism:
Human herpesvirus 4 type 2
Description:
gi_139424501
Residue:
223
  
Inhibitor
Name:
BDBM50282
Synonyms:
MLS000418506 N-phenazin-2-ylbenzamide cid_5110696
Type:
Small organic molecule
Emp. Form.:
C19H13N3O
Mol. Mass.:
299.326
SMILES:
O=C(Nc1ccc2nc3ccccc3nc2c1)c1ccccc1
: