Target
E3 ubiquitin-protein ligase Mdm2
Ligand
BDBM43375
Substrate
Meas. Tech.
E3 Ligase_Mutant_Dose Response
EC50
40770±n/a nM
Citation
 PubChem, PC E3 Ligase_Mutant_Dose Response PubChem Bioassay (2008)[AID] 
Target
Name:
E3 ubiquitin-protein ligase Mdm2
Synonyms:
Double minute 2 protein E3 ubiquitin-protein ligase Mdm2 (p53-binding protein Mdm2) Human Double Minute 2 (HDM2) MDM2-MDMX p53-Binding Protein MDM2 | p53-binding protein
Type:
Oncoprotein
Mol. Mass.:
55196.54
Organism:
Homo sapiens (Human)
Description:
Q00987
Residue:
491
  
Inhibitor
Name:
BDBM43375
Synonyms:
(2E)-2-(1-cyano-2,2,2-trifluoro-ethylidene)-5-phenyl-1,3-oxathiole-4-carboxylic acid ethyl ester 2-[1-Cyano-2,2,2-trifluoro-eth-(E)-ylidene]-5-phenyl-[1,3]oxathiole-4-carboxylic acid ethyl ester SMR000147955 ethyl (2E)-2-(1-cyano-2,2,2-trifluoroethylidene)-5-phenyl-1,3-oxathiole-4-carboxylate | ethyl (2E)-2-[1-cyano-2,2,2-tris(fluoranyl)ethylidene]-5-phenyl-1,3-oxathiole-4-carboxylate
Type:
Small organic molecule
Emp. Form.:
C15H10F3NO3S
Mol. Mass.:
341.305
SMILES:
CCOC(=O)C1=C(O\C(S1)=C(\C#N)C(F)(F)F)c1ccccc1
: