Target
E3 ubiquitin-protein ligase Mdm2
Ligand
BDBM43381
Substrate
Meas. Tech.
E3 Ligase_Mutant_Dose Response
EC50
561700±n/a nM
Citation
 PubChem, PC E3 Ligase_Mutant_Dose Response PubChem Bioassay (2008)[AID] 
Target
Name:
E3 ubiquitin-protein ligase Mdm2
Synonyms:
Double minute 2 protein E3 ubiquitin-protein ligase Mdm2 (p53-binding protein Mdm2) Human Double Minute 2 (HDM2) MDM2-MDMX p53-Binding Protein MDM2 | p53-binding protein
Type:
Oncoprotein
Mol. Mass.:
55196.54
Organism:
Homo sapiens (Human)
Description:
Q00987
Residue:
491
  
Inhibitor
Name:
BDBM43381
Synonyms:
MLS000544543 N'-[3-(2,3-dihydro-1H-inden-5-yloxymethyl)benzoyl]-2,6-dimethoxybenzohydrazide N'-[3-(indan-5-yloxymethyl)benzoyl]-2,6-dimethoxy-benzohydrazide SMR000159660 | cid_1000056
Type:
Small organic molecule
Emp. Form.:
C26H26N2O5
Mol. Mass.:
446.495
SMILES:
COc1cccc(OC)c1C(=O)NNC(=O)c1cccc(COc2ccc3CCCc3c2)c1
: