Target
Alkaline phosphatase, tissue-nonspecific isozyme
Ligand
BDBM46430
Substrate
Meas. Tech.
SAR assay for compounds activating TNAP in the presence of 100 mM DEA performed in a luminescence assay
EC50
47600±n/a nM
Citation
 PubChem, PC SAR assay for compounds activating TNAP in the presence of 100 mM DEA performed in a luminescence assay PubChem Bioassay (2009)[AID] 
Target
Name:
Alkaline phosphatase, tissue-nonspecific isozyme
Synonyms:
ALPL tissue-nonspecific alkaline phosphatase precursor
Type:
PROTEIN
Mol. Mass.:
57306.17
Organism:
Homo sapiens (Human)
Description:
ChEMBL_1448917
Residue:
524
  
Inhibitor
Name:
BDBM46430
Synonyms:
1-[5,6-bis(chloranyl)-2-(trifluoromethyl)-1,3-benzodioxol-2-yl]-3-(2-methoxyethyl)urea MLS-0315717.0001 | cid_2160836
Type:
Small organic molecule
Emp. Form.:
C12H11Cl2F3N2O4
Mol. Mass.:
375.128
SMILES:
COCCNC(=O)NC1(Oc2cc(Cl)c(Cl)cc2O1)C(F)(F)F
: