Target
Alkaline phosphatase, tissue-nonspecific isozyme
Ligand
BDBM51400
Substrate
Meas. Tech.
SAR assay for compounds activating TNAP in the presence of 100 mM DEA performed in a luminescence assay
EC50
4930±n/a nM
Citation
 PubChem, PC SAR assay for compounds activating TNAP in the presence of 100 mM DEA performed in a luminescence assay PubChem Bioassay (2009)[AID] 
Target
Name:
Alkaline phosphatase, tissue-nonspecific isozyme
Synonyms:
ALPL tissue-nonspecific alkaline phosphatase precursor
Type:
PROTEIN
Mol. Mass.:
57306.17
Organism:
Homo sapiens (Human)
Description:
ChEMBL_1448917
Residue:
524
  
Inhibitor
Name:
BDBM51400
Synonyms:
2-(2-bromanyl-4-methyl-phenoxy)-N-(1H-1,2,4-triazol-5-yl)ethanamide 2-(2-bromo-4-methylphenoxy)-N-(1H-1,2,4-triazol-5-yl)acetamide cid_719106
Type:
Small organic molecule
Emp. Form.:
C11H11BrN4O2
Mol. Mass.:
311.135
SMILES:
Cc1ccc(OCC(=O)Nc2nnc[nH]2)c(Br)c1
: