Target
Alkaline phosphatase, tissue-nonspecific isozyme
Ligand
BDBM46432
Substrate
Meas. Tech.
SAR assay for compounds activating TNAP in the presence of 100 mM DEA performed in a luminescence assay
EC50
65000±n/a nM
Citation
 PubChem, PC SAR assay for compounds activating TNAP in the presence of 100 mM DEA performed in a luminescence assay PubChem Bioassay (2009)[AID] 
Target
Name:
Alkaline phosphatase, tissue-nonspecific isozyme
Synonyms:
ALPL tissue-nonspecific alkaline phosphatase precursor
Type:
PROTEIN
Mol. Mass.:
57306.17
Organism:
Homo sapiens (Human)
Description:
ChEMBL_1448917
Residue:
524
  
Inhibitor
Name:
BDBM46432
Synonyms:
5,6-bis(chloranyl)-2-(trichloromethyl)-1,3-benzodioxol-2-amine MLS-0315722.0001 cid_1540513
Type:
Small organic molecule
Emp. Form.:
C8H4Cl5NO2
Mol. Mass.:
323.388
SMILES:
NC1(Oc2cc(Cl)c(Cl)cc2O1)C(Cl)(Cl)Cl
: