Target
Alkaline phosphatase, tissue-nonspecific isozyme
Ligand
BDBM39585
Substrate
Meas. Tech.
SAR assay for compounds activating TNAP in the presence of 100 mM DEA performed in a luminescence assay
EC50
12100±n/a nM
Citation
 PubChem, PC SAR assay for compounds activating TNAP in the presence of 100 mM DEA performed in a luminescence assay PubChem Bioassay (2009)[AID] 
Target
Name:
Alkaline phosphatase, tissue-nonspecific isozyme
Synonyms:
ALPL tissue-nonspecific alkaline phosphatase precursor
Type:
PROTEIN
Mol. Mass.:
57306.17
Organism:
Homo sapiens (Human)
Description:
ChEMBL_1448917
Residue:
524
  
Inhibitor
Name:
BDBM39585
Synonyms:
5-(4-methoxyphenyl)-N-(2-pyridinylmethyl)-[1,2,4]triazolo[1,5-a]pyrimidin-7-amine MLS000034811 [5-(4-Methoxy-phenyl)-[1,2,4]triazolo[1,5-a]pyrimidin-7-yl]-pyridin-2-ylmethyl-amine cid_655783
Type:
Small organic molecule
Emp. Form.:
C18H16N6O
Mol. Mass.:
332.3592
SMILES:
COc1ccc(cc1)-c1cc(NCc2ccccn2)n2ncnc2n1
: