Target
Alkaline phosphatase, tissue-nonspecific isozyme
Ligand
BDBM43804
Substrate
Meas. Tech.
SAR assay for compounds activating TNAP in the presence of 100 mM DEA performed in a luminescence assay
EC50
10900±n/a nM
Citation
 PubChem, PC SAR assay for compounds activating TNAP in the presence of 100 mM DEA performed in a luminescence assay PubChem Bioassay (2009)[AID] 
Target
Name:
Alkaline phosphatase, tissue-nonspecific isozyme
Synonyms:
ALPL tissue-nonspecific alkaline phosphatase precursor
Type:
PROTEIN
Mol. Mass.:
57306.17
Organism:
Homo sapiens (Human)
Description:
ChEMBL_1448917
Residue:
524
  
Inhibitor
Name:
BDBM43804
Synonyms:
4-bromanyl-N'-(3-bromophenyl)carbonyl-1-methyl-pyrazole-3-carbohydrazide 4-bromo-N'-(3-bromobenzoyl)-1-methylpyrazole-3-carbohydrazide MLS-0093408.0001 | cid_1012590
Type:
Small organic molecule
Emp. Form.:
C12H10Br2N4O2
Mol. Mass.:
402.041
SMILES:
Cn1cc(Br)c(n1)C(=O)NNC(=O)c1cccc(Br)c1
: