Target
Alkaline phosphatase, tissue-nonspecific isozyme
Ligand
BDBM32099
Substrate
Meas. Tech.
SAR assay for compounds activating TNAP in the presence of 100 mM DEA performed in a luminescence assay
EC50
100000±n/a nM
Citation
 PubChem, PC SAR assay for compounds activating TNAP in the presence of 100 mM DEA performed in a luminescence assay PubChem Bioassay (2009)[AID] 
Target
Name:
Alkaline phosphatase, tissue-nonspecific isozyme
Synonyms:
ALPL tissue-nonspecific alkaline phosphatase precursor
Type:
PROTEIN
Mol. Mass.:
57306.17
Organism:
Homo sapiens (Human)
Description:
ChEMBL_1448917
Residue:
524
  
Inhibitor
Name:
BDBM32099
Synonyms:
MLS000044274 N-[5-chloro-2-(trifluoromethyl)-1,3-benzodioxol-2-yl]-1,4-dioxa-8-azaspiro[4.5]decane-8-carboxamide cid_3243924
Type:
Small organic molecule
Emp. Form.:
C16H16ClF3N2O5
Mol. Mass.:
408.757
SMILES:
FC(F)(F)C1(NC(=O)N2CCC3(CC2)OCCO3)Oc2ccc(Cl)cc2O1
: