Target
Alkaline phosphatase, tissue-nonspecific isozyme
Ligand
BDBM34678
Substrate
Meas. Tech.
SAR assay for compounds activating TNAP in the presence of 100 mM DEA performed in a luminescence assay
EC50
100000±n/a nM
Citation
 PubChem, PC SAR assay for compounds activating TNAP in the presence of 100 mM DEA performed in a luminescence assay PubChem Bioassay (2009)[AID] 
Target
Name:
Alkaline phosphatase, tissue-nonspecific isozyme
Synonyms:
ALPL tissue-nonspecific alkaline phosphatase precursor
Type:
PROTEIN
Mol. Mass.:
57306.17
Organism:
Homo sapiens (Human)
Description:
ChEMBL_1448917
Residue:
524
  
Inhibitor
Name:
BDBM34678
Synonyms:
2-(1-phenyl-1H-pyrazol-4-yl)-1-(2,3,4-trihydroxyphenyl)ethanone 2-(1-phenylpyrazol-4-yl)-1-(2,3,4-trihydroxyphenyl)ethanone MLS000530746 cid_805519
Type:
Small organic molecule
Emp. Form.:
C17H14N2O4
Mol. Mass.:
310.3041
SMILES:
Oc1ccc(C(=O)Cc2cnn(c2)-c2ccccc2)c(O)c1O
: