Target
Ion channel NompC
Ligand
BDBM32750
Substrate
Meas. Tech.
Fluorescence counterscreen assay for TRPML3 agonists: dose response cell-based high-throughput screening assay to identify agonists of the transient receptor potential channel N1 (TRPN1)
EC50
29900±n/a nM
Citation
 PubChem, PC Fluorescence counterscreen assay for TRPML3 agonists: dose response cell-based high-throughput screening assay to identify agonists of the transient receptor potential channel N1 (TRPN1) PubChem Bioassay (2009)[AID] 
Target
Name:
Ion channel NompC
Synonyms:
transient receptor potential cation channel, subfamily N, member 1
Type:
Enzyme Catalytic Domain
Mol. Mass.:
175824.78
Organism:
Danio rerio
Description:
Q7T1G6
Residue:
1614
  
Inhibitor
Name:
BDBM32750
Synonyms:
MLS000567354 N-methyl-N-(2-phenoxyethyl)-5-piperidin-1-ylsulfonyl-pyridin-2-amine SMR000154138 methyl-(2-phenoxyethyl)-(5-piperidinosulfonyl-2-pyridyl)amine
Type:
Small organic molecule
Emp. Form.:
C19H25N3O3S
Mol. Mass.:
375.485
SMILES:
CN(CCOc1ccccc1)c1ccc(cn1)S(=O)(=O)N1CCCCC1
: