Target
Mitogen-activated protein kinase kinase kinase kinase 2
Ligand
BDBM51815
Substrate
Meas. Tech.
Dose Response Confirmation Screen via Multiplex HTS Assay for Inhibitors of MEK Kinase PB1 Domains, specifically MEK5 binding to MEK Kinase 2 Mutant
EC50
30000±n/a nM
Citation
 PubChem, PC Dose Response Confirmation Screen via Multiplex HTS Assay for Inhibitors of MEK Kinase PB1 Domains, specifically MEK5 binding to MEK Kinase 2 Mutant PubChem Bioassay (2009)[AID] 
Target
Name:
Mitogen-activated protein kinase kinase kinase kinase 2
Synonyms:
2.7.11.1 GC kinase Germinal center kinase MAP4K2 MEK kinase kinase 2 RAB8IP | Rab8-interacting protein
Type:
Mol. Mass.:
91551.35
Organism:
Homo sapiens (Human)
Description:
Residue:
820
  
Inhibitor
Name:
BDBM51815
Synonyms:
1-{[4-(4-Fluoro-phenyl)-thiazol-2-ylcarbamoyl]-methyl}-3-p-tolyl-6,7-dihydro-5H-pyrrolo[1,2-a]imidazol-1-ium N-[4-(4-fluorophenyl)-1,3-thiazol-2-yl]-2-[3-(4-methylphenyl)-6,7-dihydro-5H-pyrrolo[1,2-a]imidazol-1-ium-1-yl]acetamide;chloride N-[4-(4-fluorophenyl)-2-thiazolyl]-2-[3-(4-methylphenyl)-6,7-dihydro-5H-pyrrolo[1,2-a]imidazol-1-ium-1-yl]acetamide;chloride SMR000220548 | cid_12005692
Type:
Small organic molecule
Emp. Form.:
C24H22FN4OS
Mol. Mass.:
433.521
SMILES:
Cc1ccc(cc1)-c1c[n+](CC(=O)Nc2nc(cs2)-c2ccc(F)cc2)c2CCCn12
: