Target
Mitogen-activated protein kinase kinase kinase kinase 2
Ligand
BDBM50999
Substrate
Meas. Tech.
Dose Response Confirmation via Multiplex HTS Assay for Inhibitors of MEK Kinase PB1 Domains, specifically MEK5 binding to MEK Kinase 2 Wildtype
EC50
30000±n/a nM
Citation
 PubChem, PC Dose Response Confirmation via Multiplex HTS Assay for Inhibitors of MEK Kinase PB1 Domains, specifically MEK5 binding to MEK Kinase 2 Wildtype PubChem Bioassay (2009)[AID] 
Target
Name:
Mitogen-activated protein kinase kinase kinase kinase 2
Synonyms:
2.7.11.1 GC kinase Germinal center kinase MAP4K2 MEK kinase kinase 2 RAB8IP | Rab8-interacting protein
Type:
Mol. Mass.:
91551.35
Organism:
Homo sapiens (Human)
Description:
Residue:
820
  
Inhibitor
Name:
BDBM50999
Synonyms:
3-(1,3-benzodioxol-5-yl)-2-methylsulfonyl-5-phenyl-3,4-dihydropyrazole 5-Benzo[1,3]dioxol-5-yl-1-methanesulfonyl-3-phenyl-4,5-dihydro-1H-pyrazole SMR000172323 | cid_3153499
Type:
Small organic molecule
Emp. Form.:
C17H16N2O4S
Mol. Mass.:
344.385
SMILES:
CS(=O)(=O)N1N=C(CC1c1ccc2OCOc2c1)c1ccccc1
: