Target
Beta-lactamase
Ligand
BDBM52038
Substrate
Meas. Tech.
Epi-absorbance-based dose response biochemical high throughput screening assay for selective inhibitors of VIM-2 metallo-beta-lactamase
IC50
1730±n/a nM
Citation
 PubChem, PC Epi-absorbance-based dose response biochemical high throughput screening assay for selective inhibitors of VIM-2 metallo-beta-lactamase PubChem Bioassay (2009)[AID] 
Target
Name:
Beta-lactamase
Synonyms:
Beta lactamase
Type:
Enzyme Catalytic Domain
Mol. Mass.:
31513.38
Organism:
Pseudomonas aeruginosa
Description:
gi_114881106
Residue:
286
  
Inhibitor
Name:
BDBM52038
Synonyms:
(2S)-1-[1-oxo-2-[(3,4,8,8-tetramethyl-2-oxo-9,10-dihydropyrano[2,3-h][1]benzopyran-5-yl)oxy]ethyl]-2-pyrrolidinecarboxylic acid (2S)-1-[2-[(3,4,8,8-tetramethyl-2-oxidanylidene-9,10-dihydropyrano[2,3-h]chromen-5-yl)oxy]ethanoyl]pyrrolidine-2-carboxylic acid MLS001160409 cid_16406937
Type:
Small organic molecule
Emp. Form.:
C23H27NO7
Mol. Mass.:
429.463
SMILES:
Cc1c(C)c(=O)oc2c3CCC(C)(C)Oc3cc(OCC(=O)N3CCC[C@H]3C(O)=O)c12
: