Target
Beta-lactamase
Ligand
BDBM52022
Substrate
Meas. Tech.
FRET-based counterscreen for selective VIM-2 inhibitors: dose response biochemical high throughput screening assay to identify epi-absorbance assay artifacts.
IC50
1508±n/a nM
Citation
 PubChem, PC FRET-based counterscreen for selective VIM-2 inhibitors: dose response biochemical high throughput screening assay to identify epi-absorbance assay artifacts. PubChem Bioassay (2009)[AID] 
Target
Name:
Beta-lactamase
Synonyms:
Beta lactamase
Type:
Enzyme Catalytic Domain
Mol. Mass.:
31513.38
Organism:
Pseudomonas aeruginosa
Description:
gi_114881106
Residue:
286
  
Inhibitor
Name:
BDBM52022
Synonyms:
5-(4-bromophenyl)-1,3-dihydropyrrolo[1,2-c][1,3]thiazole-6,7-dicarboxylic acid 5-(4-bromophenyl)-1H-pyrrolo[1,2-c][1,3]thiazole-6,7-dicarboxylic acid SMR000550605 | cid_1472062
Type:
Small organic molecule
Emp. Form.:
C14H10BrNO4S
Mol. Mass.:
368.203
SMILES:
OC(=O)c1c2CSCn2c(c1C(O)=O)-c1ccc(Br)cc1
: