Target
Beta-lactamase
Ligand
BDBM52037
Substrate
Meas. Tech.
FRET-based counterscreen for selective VIM-2 inhibitors: dose response biochemical high throughput screening assay to identify epi-absorbance assay artifacts.
IC50
1725±n/a nM
Citation
 PubChem, PC FRET-based counterscreen for selective VIM-2 inhibitors: dose response biochemical high throughput screening assay to identify epi-absorbance assay artifacts. PubChem Bioassay (2009)[AID] 
Target
Name:
Beta-lactamase
Synonyms:
Beta lactamase
Type:
Enzyme Catalytic Domain
Mol. Mass.:
31513.38
Organism:
Pseudomonas aeruginosa
Description:
gi_114881106
Residue:
286
  
Inhibitor
Name:
BDBM52037
Synonyms:
(2S)-1-[2-[(2-keto-8,8-dimethyl-4-propyl-9,10-dihydropyrano[2,3-h]chromen-5-yl)oxy]acetyl]proline (2S)-1-[2-[(8,8-dimethyl-2-oxo-4-propyl-9,10-dihydropyrano[2,3-h][1]benzopyran-5-yl)oxy]-1-oxoethyl]-2-pyrrolidinecarboxylic acid MLS001160399 cid_16406618
Type:
Small organic molecule
Emp. Form.:
C24H29NO7
Mol. Mass.:
443.4896
SMILES:
CCCc1cc(=O)oc2c3CCC(C)(C)Oc3cc(OCC(=O)N3CCC[C@H]3C(O)=O)c12
: