Target
Zinc finger protein mex-5
Ligand
BDBM52490
Substrate
Meas. Tech.
Fluorescent Polarization Homogeneous Dose Response HTS to Indentify Inhibitors of Mex-5 Binding to TCR-2
EC50
4831±n/a nM
Citation
 PubChem, PC Fluorescent Polarization Homogeneous Dose Response HTS to Indentify Inhibitors of Mex-5 Binding to TCR-2 PubChem Bioassay (2009)[AID] 
Target
Name:
Zinc finger protein mex-5
Synonyms:
MEX5_CAEEL mex-5
Type:
Enzyme Catalytic Domain
Mol. Mass.:
52832.78
Organism:
Caenorhabditis elegans
Description:
gi_55976631
Residue:
468
  
Inhibitor
Name:
BDBM52490
Synonyms:
MLS000574936 cid_284998
Type:
Small organic molecule
Emp. Form.:
C21H19NO6
Mol. Mass.:
381.3787
SMILES:
COc1cc2C(=O)c3nccc4c(OC)c(OC)c(OC)c(-c2cc1OC)c34
: