Target
Zinc finger protein mex-5
Ligand
BDBM51088
Substrate
Meas. Tech.
Fluorescent Polarization Homogeneous Dose Response HTS to Indentify Inhibitors of Mex-5 Binding to TCR-2
EC50
8449±n/a nM
Citation
 PubChem, PC Fluorescent Polarization Homogeneous Dose Response HTS to Indentify Inhibitors of Mex-5 Binding to TCR-2 PubChem Bioassay (2009)[AID] 
Target
Name:
Zinc finger protein mex-5
Synonyms:
MEX5_CAEEL mex-5
Type:
Enzyme Catalytic Domain
Mol. Mass.:
52832.78
Organism:
Caenorhabditis elegans
Description:
gi_55976631
Residue:
468
  
Inhibitor
Name:
BDBM51088
Synonyms:
MLS000574995 cid_15945063
Type:
Small organic molecule
Emp. Form.:
C18H18BrNO3
Mol. Mass.:
376.244
SMILES:
Br.[H][C@]12[C@H](O)c3ccccc3-c3c4OCOc4cc(CCN1C)c23
: