Target
Zinc finger protein mex-5
Ligand
BDBM52498
Substrate
Meas. Tech.
Fluorescent Polarization Homogeneous Dose Response HTS to Indentify Inhibitors of Mex-5 Binding to TCR-2
EC50
30678±n/a nM
Citation
 PubChem, PC Fluorescent Polarization Homogeneous Dose Response HTS to Indentify Inhibitors of Mex-5 Binding to TCR-2 PubChem Bioassay (2009)[AID] 
Target
Name:
Zinc finger protein mex-5
Synonyms:
MEX5_CAEEL mex-5
Type:
Enzyme Catalytic Domain
Mol. Mass.:
52832.78
Organism:
Caenorhabditis elegans
Description:
gi_55976631
Residue:
468
  
Inhibitor
Name:
BDBM52498
Synonyms:
(E)-2-cyano-3-(7-methyl-2-piperidin-1-yl-quinolin-3-yl)prop-2-enamide (E)-2-cyano-3-(7-methyl-2-piperidino-3-quinolyl)acrylamide MLS000391760 cid_6162602
Type:
Small organic molecule
Emp. Form.:
C19H20N4O
Mol. Mass.:
320.3883
SMILES:
Cc1ccc2cc(\C=C(/C#N)C(N)=O)c(nc2c1)N1CCCCC1
: