Target
Zinc finger protein mex-5
Ligand
BDBM52606
Substrate
Meas. Tech.
Fluorescent Polarization Homogeneous Dose Response HTS to Indentify Inhibitors of Mex-5 Binding to TCR-2
EC50
300000±n/a nM
Citation
 PubChem, PC Fluorescent Polarization Homogeneous Dose Response HTS to Indentify Inhibitors of Mex-5 Binding to TCR-2 PubChem Bioassay (2009)[AID] 
Target
Name:
Zinc finger protein mex-5
Synonyms:
MEX5_CAEEL mex-5
Type:
Enzyme Catalytic Domain
Mol. Mass.:
52832.78
Organism:
Caenorhabditis elegans
Description:
gi_55976631
Residue:
468
  
Inhibitor
Name:
BDBM52606
Synonyms:
2-[(5E)-5-[(E)-3-(2-furanyl)-2-methylprop-2-enylidene]-4-oxo-2-sulfanylidene-3-thiazolidinyl]acetic acid 2-[(5E)-5-[(E)-3-(furan-2-yl)-2-methyl-prop-2-enylidene]-4-oxidanylidene-2-sulfanylidene-1,3-thiazolidin-3-yl]ethanoic acid MLS000690044 cid_2287327 | {5-[3-(2-furyl)-2-methyl-2-propen-1-ylidene]-4-oxo-2-thioxo-1,3-thiazolidin-3-yl}acetic acid
Type:
Small organic molecule
Emp. Form.:
C13H11NO4S2
Mol. Mass.:
309.361
SMILES:
C\C(=C/c1ccco1)\C=C1\SC(=S)N(CC(O)=O)C1=O
: