Target
Mannose-6-phosphate isomerase
Ligand
BDBM46664
Substrate
Meas. Tech.
HTS identification of compounds inhibiting phosphomannose isomerase (PMI) via a fluorescence intensity assay.
IC50
8325±n/a nM
Citation
 PubChem, PC HTS identification of compounds inhibiting phosphomannose isomerase (PMI) via a fluorescence intensity assay. PubChem Bioassay (2009)[AID] 
Target
Name:
Mannose-6-phosphate isomerase
Synonyms:
MPI MPI_HUMAN PMI1
Type:
PROTEIN
Mol. Mass.:
46651.35
Organism:
Homo sapiens (Human)
Description:
ChEMBL_1448919
Residue:
423
  
Inhibitor
Name:
BDBM46664
Synonyms:
3-(6-methoxy-1,3-benzothiazol-2-yl)-1,1-dimethyl-thiourea MLS-0072968.0001 | cid_944467
Type:
Small organic molecule
Emp. Form.:
C11H13N3OS2
Mol. Mass.:
267.37
SMILES:
COc1ccc2nc(NC(=S)N(C)C)sc2c1
: