Target
Mannose-6-phosphate isomerase
Ligand
BDBM34767
Substrate
Meas. Tech.
HTS identification of compounds inhibiting phosphomannose isomerase (PMI) via a fluorescence intensity assay.
IC50
1272.9±n/a nM
Citation
 PubChem, PC HTS identification of compounds inhibiting phosphomannose isomerase (PMI) via a fluorescence intensity assay. PubChem Bioassay (2009)[AID] 
Target
Name:
Mannose-6-phosphate isomerase
Synonyms:
MPI MPI_HUMAN PMI1
Type:
PROTEIN
Mol. Mass.:
46651.35
Organism:
Homo sapiens (Human)
Description:
ChEMBL_1448919
Residue:
423
  
Inhibitor
Name:
BDBM34767
Synonyms:
MLS000548244 N-(2,3-dichloro-1-methoxy-4-oxo-1-naphthalenyl)-4-methylbenzenesulfonamide N-(2,3-dichloro-4-keto-1-methoxy-1-naphthyl)-4-methyl-benzenesulfonamide SMR000171238 | cid_3093671
Type:
Small organic molecule
Emp. Form.:
C18H15Cl2NO4S
Mol. Mass.:
412.287
SMILES:
COC1(NS(=O)(=O)c2ccc(C)cc2)C(Cl)=C(Cl)C(=O)c2ccccc12
: