Target
Mannose-6-phosphate isomerase
Ligand
BDBM34841
Substrate
Meas. Tech.
HTS identification of compounds inhibiting phosphomannose isomerase (PMI) via a fluorescence intensity assay.
IC50
21281±n/a nM
Citation
 PubChem, PC HTS identification of compounds inhibiting phosphomannose isomerase (PMI) via a fluorescence intensity assay. PubChem Bioassay (2009)[AID] 
Target
Name:
Mannose-6-phosphate isomerase
Synonyms:
MPI MPI_HUMAN PMI1
Type:
PROTEIN
Mol. Mass.:
46651.35
Organism:
Homo sapiens (Human)
Description:
ChEMBL_1448919
Residue:
423
  
Inhibitor
Name:
BDBM34841
Synonyms:
2-[2-hydroxyethyl(2-naphthalenyl)amino]ethanol 2-[2-hydroxyethyl(naphthalen-2-yl)amino]ethanol SMR000279821 | cid_160818
Type:
Small organic molecule
Emp. Form.:
C14H17NO2
Mol. Mass.:
231.2903
SMILES:
OCCN(CCO)c1ccc2ccccc2c1
: