Target
Mannose-6-phosphate isomerase
Ligand
BDBM46618
Substrate
Meas. Tech.
HTS identification of compounds inhibiting phosphomannose isomerase (PMI) via a fluorescence intensity assay.
IC50
9411.5±n/a nM
Citation
 PubChem, PC HTS identification of compounds inhibiting phosphomannose isomerase (PMI) via a fluorescence intensity assay. PubChem Bioassay (2009)[AID] 
Target
Name:
Mannose-6-phosphate isomerase
Synonyms:
MPI MPI_HUMAN PMI1
Type:
PROTEIN
Mol. Mass.:
46651.35
Organism:
Homo sapiens (Human)
Description:
ChEMBL_1448919
Residue:
423
  
Inhibitor
Name:
BDBM46618
Synonyms:
1-(4-ethoxyphenyl)-3-(5-methyl-1H-pyrazol-3-yl)thiourea cid_935266 | mls-0272219.0001
Type:
Small organic molecule
Emp. Form.:
C13H16N4OS
Mol. Mass.:
276.357
SMILES:
CCOc1ccc(NC(=S)Nc2cc(C)n[nH]2)cc1
: