Target
Mannose-6-phosphate isomerase
Ligand
BDBM34971
Substrate
Meas. Tech.
HTS identification of compounds inhibiting phosphomannose isomerase (PMI) via a fluorescence intensity assay.
IC50
11573±n/a nM
Citation
 PubChem, PC HTS identification of compounds inhibiting phosphomannose isomerase (PMI) via a fluorescence intensity assay. PubChem Bioassay (2009)[AID] 
Target
Name:
Mannose-6-phosphate isomerase
Synonyms:
MPI MPI_HUMAN PMI1
Type:
PROTEIN
Mol. Mass.:
46651.35
Organism:
Homo sapiens (Human)
Description:
ChEMBL_1448919
Residue:
423
  
Inhibitor
Name:
BDBM34971
Synonyms:
(4E)-2,3-dihydroxy-4-[(4-morpholinylamino)methylidene]-1-cyclohexa-2,5-dienone (4E)-2,3-dihydroxy-4-[(morpholinoamino)methylene]cyclohexa-2,5-dien-1-one MLS000773393 cid_6287028
Type:
Small organic molecule
Emp. Form.:
C11H14N2O4
Mol. Mass.:
238.2399
SMILES:
Oc1ccc(C=NN2CCOCC2)c(O)c1O
: