Target
M1 family aminopeptidase
Ligand
BDBM52174
Substrate
Meas. Tech.
Inhibitors of Plasmodium falciparum M1- Family Alanyl Aminopeptidase (M1AAP)
IC50
4670±n/a nM
Citation
 PubChem, PC Inhibitors of Plasmodium falciparum M1- Family Alanyl Aminopeptidase (M1AAP) PubChem Bioassay (2008)[AID] 
Target
Name:
M1 family aminopeptidase
Synonyms:
AMPN_PLAF7 Zinc aminopeptidase | m1-family aminopeptidase
Type:
PROTEIN
Mol. Mass.:
126072.31
Organism:
Plasmodium falciparum (isolate FcB1 / Columbia)
Description:
ChEMBL_735637
Residue:
1085
  
Inhibitor
Name:
BDBM52174
Synonyms:
1-(5-bromanylthiophen-2-yl)sulfonyl-N-(thiophen-2-ylmethyl)piperidine-4-carboxamide 1-[(5-bromo-2-thienyl)sulfonyl]-N-(2-thenyl)isonipecotamide 1-[(5-bromothien-2-yl)sulfonyl]-N-(thien-2-ylmethyl)piperidine-4-carboxamide SMR000025428 | cid_3244525
Type:
Small organic molecule
Emp. Form.:
C15H17BrN2O3S3
Mol. Mass.:
449.406
SMILES:
Brc1ccc(s1)S(=O)(=O)N1CCC(CC1)C(=O)NCc1cccs1
: