Target
M1 family aminopeptidase
Ligand
BDBM53912
Substrate
Meas. Tech.
Inhibitors of Plasmodium falciparum M1- Family Alanyl Aminopeptidase (M1AAP)
IC50
3220±n/a nM
Citation
 PubChem, PC Inhibitors of Plasmodium falciparum M1- Family Alanyl Aminopeptidase (M1AAP) PubChem Bioassay (2008)[AID] 
Target
Name:
M1 family aminopeptidase
Synonyms:
AMPN_PLAF7 Zinc aminopeptidase | m1-family aminopeptidase
Type:
PROTEIN
Mol. Mass.:
126072.31
Organism:
Plasmodium falciparum (isolate FcB1 / Columbia)
Description:
ChEMBL_735637
Residue:
1085
  
Inhibitor
Name:
BDBM53912
Synonyms:
MLS000705157 N-[(5Z)-5-(1-acetyl-2-oxo-3-indolylidene)-4-oxo-2-sulfanylidene-3-thiazolidinyl]-4-methylbenzenesulfonamide N-[(5Z)-5-(1-ethanoyl-2-oxidanylidene-indol-3-ylidene)-4-oxidanylidene-2-sulfanylidene-1,3-thiazolidin-3-yl]-4-methyl-benzenesulfonamide SMR000230554 | cid_16189301
Type:
Small organic molecule
Emp. Form.:
C20H15N3O5S3
Mol. Mass.:
473.545
SMILES:
CC(=O)N1C(=O)C(=C2SC(=S)N(NS(=O)(=O)c3ccc(C)cc3)C2=O)c2ccccc12
: