Target
M1 family aminopeptidase
Ligand
BDBM53992
Substrate
Meas. Tech.
Inhibitors of Plasmodium falciparum M1- Family Alanyl Aminopeptidase (M1AAP)
IC50
5630±n/a nM
Citation
 PubChem, PC Inhibitors of Plasmodium falciparum M1- Family Alanyl Aminopeptidase (M1AAP) PubChem Bioassay (2008)[AID] 
Target
Name:
M1 family aminopeptidase
Synonyms:
AMPN_PLAF7 Zinc aminopeptidase | m1-family aminopeptidase
Type:
PROTEIN
Mol. Mass.:
126072.31
Organism:
Plasmodium falciparum (isolate FcB1 / Columbia)
Description:
ChEMBL_735637
Residue:
1085
  
Inhibitor
Name:
BDBM53992
Synonyms:
(2E)-2-[[(2-chlorobenzyl)amino]methylene]-4H-1,4-benzothiazin-3-one 2-{[(2-chlorobenzyl)amino]methylene}-2H-1,4-benzothiazin-3(4H)-one SMR000332963 | cid_1475215
Type:
Small organic molecule
Emp. Form.:
C16H13ClN2OS
Mol. Mass.:
316.805
SMILES:
Clc1ccccc1CN=CC1Sc2ccccc2NC1=O
: