Target
M1 family aminopeptidase
Ligand
BDBM50536
Substrate
Meas. Tech.
Inhibitors of Plasmodium falciparum M1- Family Alanyl Aminopeptidase (M1AAP)
IC50
1000±n/a nM
Citation
 PubChem, PC Inhibitors of Plasmodium falciparum M1- Family Alanyl Aminopeptidase (M1AAP) PubChem Bioassay (2008)[AID] 
Target
Name:
M1 family aminopeptidase
Synonyms:
AMPN_PLAF7 Zinc aminopeptidase | m1-family aminopeptidase
Type:
PROTEIN
Mol. Mass.:
126072.31
Organism:
Plasmodium falciparum (isolate FcB1 / Columbia)
Description:
ChEMBL_735637
Residue:
1085
  
Inhibitor
Name:
BDBM50536
Synonyms:
MLS000685727 N-[(5Z)-5-(5-bromo-2-keto-indolin-3-ylidene)-4-keto-2-thioxo-thiazolidin-3-yl]benzenesulfonamide N-[(5Z)-5-(5-bromo-2-oxo-1H-indol-3-ylidene)-4-oxo-2-sulfanylidene-1,3-thiazolidin-3-yl]benzenesulfonamide SMR000312691 | cid_6027465
Type:
Small organic molecule
Emp. Form.:
C17H10BrN3O4S3
Mol. Mass.:
496.378
SMILES:
Brc1ccc2NC(=O)\C(=C3/SC(=S)N(NS(=O)(=O)c4ccccc4)C3=O)c2c1
: