Target
M1 family aminopeptidase
Ligand
BDBM54023
Substrate
Meas. Tech.
Inhibitors of Plasmodium falciparum M1- Family Alanyl Aminopeptidase (M1AAP)
IC50
9300±n/a nM
Citation
 PubChem, PC Inhibitors of Plasmodium falciparum M1- Family Alanyl Aminopeptidase (M1AAP) PubChem Bioassay (2008)[AID] 
Target
Name:
M1 family aminopeptidase
Synonyms:
AMPN_PLAF7 Zinc aminopeptidase | m1-family aminopeptidase
Type:
PROTEIN
Mol. Mass.:
126072.31
Organism:
Plasmodium falciparum (isolate FcB1 / Columbia)
Description:
ChEMBL_735637
Residue:
1085
  
Inhibitor
Name:
BDBM54023
Synonyms:
6-[(2-chlorobenzyl)thio]-1,2-dihydropyrazolo[3,4-d]pyrimidin-4-one 6-[(2-chlorophenyl)methylthio]-1,2-dihydropyrazolo[3,4-d]pyrimidin-4-one SMR000324931 | cid_7151698
Type:
Small organic molecule
Emp. Form.:
C12H9ClN4OS
Mol. Mass.:
292.744
SMILES:
Clc1ccccc1CSc1nc2n[nH]cc2c(=O)[nH]1
: