Target
M1 family aminopeptidase
Ligand
BDBM54098
Substrate
Meas. Tech.
Inhibitors of Plasmodium falciparum M1- Family Alanyl Aminopeptidase (M1AAP)
IC50
7390±n/a nM
Citation
 PubChem, PC Inhibitors of Plasmodium falciparum M1- Family Alanyl Aminopeptidase (M1AAP) PubChem Bioassay (2008)[AID] 
Target
Name:
M1 family aminopeptidase
Synonyms:
AMPN_PLAF7 Zinc aminopeptidase | m1-family aminopeptidase
Type:
PROTEIN
Mol. Mass.:
126072.31
Organism:
Plasmodium falciparum (isolate FcB1 / Columbia)
Description:
ChEMBL_735637
Residue:
1085
  
Inhibitor
Name:
BDBM54098
Synonyms:
MLS000769597 N-[5-(4-keto-3-methyl-phthalazin-1-yl)-2-methyl-benzyl]benzamide N-[[2-methyl-5-(3-methyl-4-oxo-1-phthalazinyl)phenyl]methyl]benzamide SMR000434330 | cid_1885969
Type:
Small organic molecule
Emp. Form.:
C24H21N3O2
Mol. Mass.:
383.4424
SMILES:
Cc1ccc(cc1CNC(=O)c1ccccc1)-c1nn(C)c(=O)c2ccccc12
: