Target
Cell division control protein 42 homolog
Ligand
BDBM54631
Substrate
Meas. Tech.
Pyrazoline SAR compounds tested via Multiplex dose response to identify specific small molecule inhibitors of Ras and Ras-related GTPases specifically Cdc42 wildtype protein
EC50
30000±n/a nM
Citation
 PubChem, PC Pyrazoline SAR compounds tested via Multiplex dose response to identify specific small molecule inhibitors of Ras and Ras-related GTPases specifically Cdc42 wildtype protein PubChem Bioassay (2009)[AID] 
Target
Name:
Cell division control protein 42 homolog
Synonyms:
CDC42 Cell division control protein 42 homolog cell division cycle 42 (GTP binding protein, 25kDa)
Type:
PROTEIN
Mol. Mass.:
21258.36
Organism:
Homo sapiens (Human)
Description:
ChEMBL_652970
Residue:
191
  
Inhibitor
Name:
BDBM54631
Synonyms:
2-chloranyl-5-[3-(3,4-dimethoxyphenyl)-5-phenyl-3,4-dihydropyrazol-2-yl]benzoic acid 2-chloro-5-[5-(3,4-dimethoxyphenyl)-3-phenyl-2-pyrazolin-1-yl]benzoic acid cid_2975283
Type:
Small organic molecule
Emp. Form.:
C24H21ClN2O4
Mol. Mass.:
436.888
SMILES:
COc1ccc(cc1OC)C1CC(=NN1c1ccc(Cl)c(c1)C(O)=O)c1ccccc1
: