Target
Cell division control protein 42 homolog
Ligand
BDBM54626
Substrate
Meas. Tech.
Pyrazoline SAR compounds tested via Multiplex dose response to identify specific small molecule inhibitors of Ras and Ras-related GTPases specifically Cdc42 activated mutant
Ki
4860±n/a nM
Citation
 PubChem, PC Pyrazoline SAR compounds tested via Multiplex dose response to identify specific small molecule inhibitors of Ras and Ras-related GTPases specifically Cdc42 activated mutant PubChem Bioassay (2009)[AID] 
Target
Name:
Cell division control protein 42 homolog
Synonyms:
CDC42 Cell division control protein 42 homolog cell division cycle 42 (GTP binding protein, 25kDa)
Type:
PROTEIN
Mol. Mass.:
21258.36
Organism:
Homo sapiens (Human)
Description:
ChEMBL_652970
Residue:
191
  
Inhibitor
Name:
BDBM54626
Synonyms:
3-(4-chlorophenyl)-2-(3-fluorophenyl)-5-(4-methoxyphenyl)-3,4-dihydropyrazole UNM-0000305865 | cid_2883157
Type:
Small organic molecule
Emp. Form.:
C22H18ClFN2O
Mol. Mass.:
380.843
SMILES:
COc1ccc(cc1)C1=NN(C(C1)c1ccc(Cl)cc1)c1cccc(F)c1
: